BDBM205081 US9556132, 65::process for preparing 1-phenyl-5-(2-phenylphenyl)-1h-1,2,3,4-tetrazole
SMILES c1ccc(cc1)\N=C(/c1ccccc1-c1ccccc1)n1nnc2ccccc12
InChI Key InChIKey=UJQSORTWYRLRNY-OCEACIFDSA-N
Data  1 IC50
  Tab Delimited (TSV)   2D SDfile   Computed 3D by Vconf -m prep SDfile
Find this compound or compounds like it in BindingDB:
Activity Spreadsheet -- Enzyme Inhibition Constant Data from BindingDB
Found 1 hit for monomerid = 205081
LigandPNGBDBM205081(US9556132, 65 | process for preparing 1-phenyl-5-(...)
Affinity DataIC50:  890nMpH: 7.3Assay Description:Human HEK293 cells over-expressing human IK are grown in culture medium (DMEM supplemented with 10% foetal bovine serum), in polystyrene culture flas...
Ligand InfoPC cidPC sid
In DepthDetails US Patent