BDBM205182 3-methyl-2-({(3r,6r)-6- methyl-1-[(3-pyrimidin-2- ylthiophen-2- yl)carbonyl]piperidin-3- yl}oxy)pyridine-4- carbonitrile::US9546152, example 75
SMILES C[C@@H]1CC[C@H](CN1C(=O)c1sccc1-c1ncccn1)Oc1nccc(C#N)c1C
InChI Key InChIKey=IGGMQLWKZGOINS-RHSMWYFYSA-N
Data  2 KI  2 IC50
  Tab Delimited (TSV)   2D SDfile   Computed 3D by Vconf -m prep SDfile
Find this compound or compounds like it in BindingDB:
Activity Spreadsheet -- Enzyme Inhibition Constant Data from BindingDB
Found 4 hits for monomerid = 205182
TargetOrexin receptor type 2(Homo sapiens (Human))
Merck Sharp & Dohme
US Patent
LigandPNGBDBM205182(3-methyl-2-({(3r,6r)-6- methyl-1-[(3-pyrimidin-2- ...)
Affinity DataKi:  0.800nM. Assay description: Radioligand binding assay (described in Bergman et. al. Bioorg. Med. Chem. Lett. 2008, 18, 1425-1430) in which the inhibition constant (Ki) is determ...
Ligand InfoPC cidPC sid
In DepthDetails US Patent
TargetOrexin/Hypocretin receptor type 1(Homo sapiens (Human))
Merck Sharp & Dohme
US Patent
LigandPNGBDBM205182(3-methyl-2-({(3r,6r)-6- methyl-1-[(3-pyrimidin-2- ...)
Affinity DataKi:  386nM. Assay description: Radioligand binding assay (described in Bergman et. al. Bioorg. Med. Chem. Lett. 2008, 18, 1425-1430) in which the inhibition constant (Ki) is determ...
Ligand InfoPC cidPC sid
In DepthDetails US Patent
TargetOrexin receptor type 2(Homo sapiens (Human))
Merck Sharp & Dohme
US Patent
LigandPNGBDBM205182(3-methyl-2-({(3r,6r)-6- methyl-1-[(3-pyrimidin-2- ...)
Affinity DataIC50:  15nM. Assay description: The utility of the compounds in accordance with the present invention as orexin receptor OX1R and/or OX2R antagonists may be readily determined witho...
Ligand InfoPC cidPC sid
In DepthDetails US Patent
TargetOrexin/Hypocretin receptor type 1(Homo sapiens (Human))
Merck Sharp & Dohme
US Patent
LigandPNGBDBM205182(3-methyl-2-({(3r,6r)-6- methyl-1-[(3-pyrimidin-2- ...)
Affinity DataIC50:  1.40E+3nM. Assay description: The utility of the compounds in accordance with the present invention as orexin receptor OX1R and/or OX2R antagonists may be readily determined witho...
Ligand InfoPC cidPC sid
In DepthDetails US Patent