BDBM205449 IBETx2-PEG1 (30)
SMILES COc1cc2c3n([C@@H](C)c4ccccn4)c(=O)n(CC(=O)NCCOCCNC(=O)Cn4c5cnc6cc(-c7c(C)noc7C)c(OC)cc6c5n([C@H](C)c5ccccn5)c4=O)c3cnc2cc1-c1c(C)noc1C
InChI Key InChIKey=JCGSQIXZALUTFO-MEKGRNQZSA-N
Data  2 IC50
  Tab Delimited (TSV)   2D SDfile   Computed 3D by Vconf -m prep SDfile
Find this compound or compounds like it in BindingDB:
Activity Spreadsheet -- Enzyme Inhibition Constant Data from BindingDB
Found 2 hits for monomerid = 205449
TargetBromodomain testis-specific protein [21-137](Homo sapiens (Human))
Dana-Farber Cancer Institute
LigandPNGBDBM205449(IBETx2-PEG1 (30))
Affinity DataIC50:  203nMpH: 7.5 T: 2°C. Assay description: Assays were performed with minor modifications from the manufacturer's protocol (PerkinElmer, USA). All reagents were diluted in 50 mM HEPES, 150...
Ligand InfoPC cidPC sid
In DepthDetails ArticlePubMed
TargetBromodomain-containing protein 4 [44-168](Homo sapiens (Human))
Dana-Farber Cancer Institute
LigandPNGBDBM205449(IBETx2-PEG1 (30))
Affinity DataIC50:  108nMpH: 7.5 T: 2°C. Assay description: Assays were performed with minor modifications from the manufacturer's protocol (PerkinElmer, USA). All reagents were diluted in 50 mM HEPES, 150...
Ligand InfoPC cidPC sid
In DepthDetails ArticlePubMed