BDBM205516 US9253997, 76
SMILES CN(C)[C@@H](CCC(=O)Nc1cc(Cl)cc(c1O)S(O)(=O)=O)C(O)=O
InChI Key InChIKey=OGFXRPHTBPWZCA-VIFPVBQESA-N
Data  1 EC50
  Tab Delimited (TSV)   2D SDfile   Computed 3D by Vconf -m prep SDfile
Find this compound or compounds like it in BindingDB:
Activity Spreadsheet -- Enzyme Inhibition Constant Data from BindingDB
Found 1 hit for monomerid = 205516
TargetExtracellular calcium-sensing receptor(Homo sapiens (Human))
Ajinomoto
US Patent
LigandPNGBDBM205516(US9253997, 76)
Affinity DataEC50:  1.80E+3nMpH: 7.2 T: 2°C. Assay description: 293E cells (EBNA1-expressing IIEK293 cells, ATCC No. CRL-10852) were cultured in DMEM (1.0 g/ml Glucose-containing Dulbecco's modified Eagle medium, ...
Ligand InfoPC cidPC sid
In DepthDetails US Patent