BDBM20555 3-amino-8-({6-[4-(trifluoromethyl)phenyl]pyrimidin-4-yl}oxy)-1,2-dihydroquinoxalin-2-one::4-Oxopyrimidine, 33
SMILES Nc1nc2cccc(Oc3cc(ncn3)-c3ccc(cc3)C(F)(F)F)c2[nH]c1=O
InChI Key InChIKey=CORBDYOIGBQLNW-UHFFFAOYSA-N
Data  2 IC50
  Tab Delimited (TSV)   2D SDfile   Computed 3D by Vconf -m prep SDfile
Find this compound or compounds like it in BindingDB:
Activity Spreadsheet -- Enzyme Inhibition Constant Data from BindingDB
Found 2 hits for monomerid = 20555
LigandPNGBDBM20555(3-amino-8-({6-[4-(trifluoromethyl)phenyl]pyrimidin...)
Affinity DataIC50: >4.00E+3nM. Assay description: TRPV1 activities were monitored as a function of cellular uptake of radioactive calcium (45Ca2+). The test compounds were preincubated with TRPV1 exp...
In DepthDetails ArticlePubMed
LigandPNGBDBM20555(3-amino-8-({6-[4-(trifluoromethyl)phenyl]pyrimidin...)
Affinity DataIC50: >4.00E+3nMpH: 7.4 T: 2°C. Assay description: TRPV1 activities were monitored as a function of cellular uptake of radioactive calcium (45Ca2+). The test compounds were preincubated with TRPV1 exp...
In DepthDetails ArticlePubMed