BDBM205943 US9255090, 412
SMILES OC(=O)Cc1ccc(OC(F)F)c(c1)-c1ccc(F)c2CCN(Cc12)C(=O)OCc1ccccc1
InChI Key InChIKey=INYSRYFOEKYZES-UHFFFAOYSA-N
Data  1 IC50
  Tab Delimited (TSV)   2D SDfile   Computed 3D by Vconf -m prep SDfile
Find this compound or compounds like it in BindingDB:
Activity Spreadsheet -- Enzyme Inhibition Constant Data from BindingDB
Found 1 hit for monomerid = 205943
TargetProstaglandin D2 receptor 2(Homo sapiens (Human))
Actelion Pharmaceuticals
US Patent
LigandPNGBDBM205943(US9255090, 412)
Affinity DataIC50:  1.80nMpH: 7.0 T: 2°C. Assay description: Binding assay was performed in a final assay volume of 250 ul. First, 25 ul of test compound, previously diluted in Binding-Buffer (Binding-Buffer: 5...
Ligand InfoPC cidPC sid
In DepthDetails US Patent