BDBM206299 5-(1-((4-oxo-2-phenyl-4H-chromen-6-yl)methyl)-1H-1,2,3-triazol-4-yl)-N-phenylpentanamide (Az1k8)
SMILES O=C(CCCCc1cn(Cc2ccc3oc(cc(=O)c3c2)-c2ccccc2)nn1)Nc1ccccc1
InChI Key InChIKey=FYTNYIPAJGCHFY-UHFFFAOYSA-N
Data  2 IC50
  Tab Delimited (TSV)   2D SDfile   Computed 3D by Vconf -m prep SDfile
Find this compound or compounds like it in BindingDB:
Activity Spreadsheet -- Enzyme Inhibition Constant Data from BindingDB
Found 3 hits for monomerid = 206299
TargetAmine oxidase [flavin-containing] A(Homo sapiens (Human))
Zhejiang University Of Technology
LigandPNGBDBM206299(5-(1-((4-oxo-2-phenyl-4H-chromen-6-yl)methyl)-1H-1...)
Affinity DataIC50:  3.27E+5nM. Assay description: The inhibitory activities of flavones were determined in vitroby using fluorescent probe method following the general proceduredescribed in the liter...
Ligand InfoPC cidPC sid
In DepthDetails ArticlePubMed
TargetAmine oxidase [flavin-containing] B(Homo sapiens (Human))TBA
LigandPNGBDBM206299(5-(1-((4-oxo-2-phenyl-4H-chromen-6-yl)methyl)-1H-1...)
Affinity DataIC50:  1.56E+4nM
Ligand InfoPC cidPC sid
In DepthDetails
TargetAmine oxidase [flavin-containing] B(Homo sapiens (Human))TBA
LigandPNGBDBM206299(5-(1-((4-oxo-2-phenyl-4H-chromen-6-yl)methyl)-1H-1...)
Affinity DataIC50:  1.39E+5nM. Assay description: The inhibitory activities of flavones were determined in vitroby using fluorescent probe method following the general proceduredescribed in the liter...
Ligand InfoPC cidPC sid
In DepthDetails ArticlePubMed