BDBM206308 5-(1-((2-(4-chlorophenyl)-4-oxo-4H-chromen-6-yl)methyl)-1H-1,2,3-triazol-4-yl)-N-phenylpentanamide (Az2k8)
SMILES Clc1ccc(cc1)-c1cc(=O)c2cc(Cn3cc(CCCCC(=O)Nc4ccccc4)nn3)ccc2o1
InChI Key InChIKey=UFRJUCNOPPEHIH-UHFFFAOYSA-N
Data  1 IC50
  Tab Delimited (TSV)   2D SDfile   Computed 3D by Vconf -m prep SDfile
Find this compound or compounds like it in BindingDB:
Activity Spreadsheet -- Enzyme Inhibition Constant Data from BindingDB
Found 1 hit for monomerid = 206308
TargetAmine oxidase [flavin-containing] B(Homo sapiens (Human))
Zhejiang University Of Technology
LigandPNGBDBM206308(5-(1-((2-(4-chlorophenyl)-4-oxo-4H-chromen-6-yl)me...)
Affinity DataIC50:  6.26E+5nM. Assay description: The inhibitory activities of flavones were determined in vitroby using fluorescent probe method following the general proceduredescribed in the liter...
Ligand InfoPC cidPC sid
In DepthDetails ArticlePubMed