BDBM206563 US9260425, 316
SMILES Cc1ccc(nc1N1CC[C@@H](N)C1)-c1n[nH]c2cnc(cc12)-c1cccnc1
InChI Key
Data  1 KI
  Tab Delimited (TSV)   2D SDfile   Computed 3D by Vconf -m prep SDfile
Find this compound or compounds like it in BindingDB:
Activity Spreadsheet -- Enzyme Inhibition Constant Data from BindingDB
Found 1 hit for monomerid = 206563
TargetSerine/threonine-protein kinase pim-1(Homo sapiens (Human))
Genetech
US Patent
LigandPNGBDBM206563(US9260425, 316)
Affinity DataKi:  0.0549nMpH: 7.2Assay Description:PIM-1, PIM-2, and PIM-3 enzymes were generated as fusion proteins expressed in bacteria and purified by IMAC column chromatography (Sun, X., Chiu, J....
Ligand InfoPC cidPC sid
In DepthDetails US Patent