BDBM20692 PF-3052334::pyrazole-based inhibitor, 35::sodium (3R,5R)-7-[1-(4-fluorophenyl)-3-{[(4-methylphenyl)methyl]carbamoyl}-4-(propan-2-yl)-1H-pyrazol-5-yl]-3,5-dihydroxyheptanoate
SMILES CC(C)c1c(CC[C@@H](O)C[C@@H](O)CC([O-])=O)n(nc1C(=O)NCc1ccc(C)cc1)-c1ccc(F)cc1
InChI Key InChIKey=LRVVTOGAGAXSRZ-DHIUTWEWSA-M
Data  1 IC50  1 EC50
  Tab Delimited (TSV)   2D SDfile   Computed 3D by Vconf -m prep SDfile
Find this compound or compounds like it in BindingDB:
Activity Spreadsheet -- Enzyme Inhibition Constant Data from BindingDB
Found 1 hit for monomerid = 20692
Target3-hydroxy-3-methylglutaryl-coenzyme A reductase(Rattus norvegicus (rat))
Pfizer
LigandPNGBDBM20692(PF-3052334 | pyrazole-based inhibitor, 35 | sodium...)
Affinity DataIC50:  1.90nM EC50:  0.900nMpH: 7.2 T: 2°C. Assay description: Enzyme Assay for HMG-CoA reductase was based on the conversion of isotopically labeled HMG-CoA to mevalonic acid using rat liver microsomes as enzyme...
In DepthDetails ArticlePubMed