BDBM206920 US9233965, 64
SMILES COc1ccc(cc1)-c1c(Cl)n2CCN(Cc2c1C(N)=O)C(=O)NC(C)(C)C
InChI Key InChIKey=UJWNVZGUDFRAID-UHFFFAOYSA-N
Data  1 IC50
  Tab Delimited (TSV)   2D SDfile   Computed 3D by Vconf -m prep SDfile
Find this compound or compounds like it in BindingDB:
Activity Spreadsheet -- Enzyme Inhibition Constant Data from BindingDB
Found 1 hit for monomerid = 206920
TargetCasein kinase I isoform epsilon(Homo sapiens (Human))
Sanofi
US Patent
LigandPNGBDBM206920(US9233965, 64)
Affinity DataIC50:  2nMpH: 7.5 T: 2°C. Assay description: "U"-bottomed Falcon plates are prepared by placing 5 uL of solutions of the compounds according to the invention at concentrations of 10, 1, 0.1, 0.0...
Ligand InfoPC cidPC sid
In DepthDetails US Patent