BDBM207276 US9260439, 460
SMILES COC(=O)N1CC(C)(C1)N1CCc2c1nc(nc2-c1cnc(N)nc1)N1CCOC[C@@H]1C
InChI Key InChIKey=VWWLGMNSQARAOD-ZDUSSCGKSA-N
Data  1 KI
  Tab Delimited (TSV)   2D SDfile   Computed 3D by Vconf -m prep SDfile
Find this compound or compounds like it in BindingDB:
Activity Spreadsheet -- Enzyme Inhibition Constant Data from BindingDB
Found 1 hit for monomerid = 207276
LigandPNGBDBM207276(US9260439, 460)
Affinity DataKi:  0.0470nM. Assay description: PI3KA_Act: Genes encoding for full length p110alpha and p85alpha nSH-iSH2=niSH2 (p85a aminoacids 322-600) subunits of PI3Kalpha complex were subclone...
Ligand InfoPC cidPC sid
In DepthDetails US Patent