BDBM20728 (1S,2S)-2-[(4-{4-[(phenylcarbamoyl)amino]phenyl}phenyl)carbonyl]cyclopentane-1-carboxylic acid::Urea-based Analogue, 5
SMILES OC(=O)[C@H]1CCC[C@@H]1C(=O)c1ccc(cc1)-c1ccc(NC(=O)Nc2ccccc2)cc1
InChI Key InChIKey=BOZRFEQDOFSZBV-GOTSBHOMSA-N
Data  1 IC50
  Tab Delimited (TSV)   2D SDfile   Computed 3D by Vconf -m prep SDfile
Find this compound or compounds like it in BindingDB:
Activity Spreadsheet -- Enzyme Inhibition Constant Data from BindingDB
Found 1 hit for monomerid = 20728
TargetDiacylglycerol O-acyltransferase 1(Homo sapiens (Human))
Abbott Laboratories
LigandPNGBDBM20728((1S,2S)-2-[(4-{4-[(phenylcarbamoyl)amino]phenyl}ph...)
Affinity DataIC50:  96nMpH: 7.5 T: 2°C. Assay description: DGAT-1 activity was characterized by catalyzing the transfer of the radiolabeled decanoyl group onto the syn-3 position of didecanoyl glycerol. The r...
In DepthDetails ArticlePubMed