BDBM207305 US9260439, 489
SMILES C[C@H]1COCCN1c1nc2N(CCc2c(n1)-c1cnc(N)nc1)[C@@]1(C)CCN(C1)C(=O)C(F)(F)CN
InChI Key InChIKey=SOYHGJDOYKXJSX-FPTDNZKUSA-N
Data  1 KI
  Tab Delimited (TSV)   2D SDfile   Computed 3D by Vconf -m prep SDfile
Find this compound or compounds like it in BindingDB:
Activity Spreadsheet -- Enzyme Inhibition Constant Data from BindingDB
Found 1 hit for monomerid = 207305
LigandPNGBDBM207305(US9260439, 489)
Affinity DataKi: <0.0180nM. Assay description: PI3KA_Act: Genes encoding for full length p110alpha and p85alpha nSH-iSH2=niSH2 (p85a aminoacids 322-600) subunits of PI3Kalpha complex were subclone...
Ligand InfoPC cidPC sid
In DepthDetails US Patent