BDBM207347 US9546153, ex. 24
SMILES CC(C)Nc1cc(Nc2ccc3ncoc3c2)ncc1C(=O)NC[C@@H](F)C(O)C(C)C
InChI Key InChIKey=TWCWWKFUYFUDBW-UJONTBEJSA-N
Data  1 IC50
  Tab Delimited (TSV)   2D SDfile   Computed 3D by Vconf -m prep SDfile
Find this compound or compounds like it in BindingDB:
Activity Spreadsheet -- Enzyme Inhibition Constant Data from BindingDB
Found 1 hit for monomerid = 207347
TargetInterleukin-1 receptor-associated kinase 4(Homo sapiens (Human))
Bristol-Myers Squibb
US Patent
LigandPNGBDBM207347(US9546153, ex. 24)
Affinity DataIC50:  4nMpH: 7.2 T: 2°C. Assay description: The assays were performed in U-bottom 384-well plates. The final assay volume was 30 μL prepared from 15 μL additions of enzyme and substra...
Ligand InfoPC cidPC sid
In DepthDetails US Patent