BDBM207586 US10501467, Example 31::US9260440, 31::US9617273, Example 31
SMILES CC1(C)Cc2n(CCN3CCCCC3)c3cccc4c3c2c(C1)n[nH]c4=O
InChI Key InChIKey=LNWPRZVIPZXIHL-UHFFFAOYSA-N
Data  14 IC50  1 EC50
  Tab Delimited (TSV)   2D SDfile   Computed 3D by Vconf -m prep SDfile
Find this compound or compounds like it in BindingDB:
Activity Spreadsheet -- Enzyme Inhibition Constant Data from BindingDB
Found 15 hits for monomerid = 207586
TargetPoly [ADP-ribose] polymerase 1(Homo sapiens (Human))
Beigene
US Patent
LigandPNGBDBM207586(US10501467, Example 31 | US9260440, 31 | US9617273...)
Affinity DataIC50:  2.90nMpH: 8.0Assay Description:PARP-1 enzymatic assay was conducted using a method modified from HT F Homogeneous PARP Inhibition Assay Kit (Trevigen). 8.8 nM PARP-1 was pre-incuba...
Ligand InfoPC cidPC sid
In DepthDetails US Patent
TargetPoly [ADP-ribose] polymerase 1(Homo sapiens (Human))
Beigene
US Patent
LigandPNGBDBM207586(US10501467, Example 31 | US9260440, 31 | US9617273...)
Affinity DataIC50:  2.90nM. Assay description: Inhibition of human PARP-1 catalytic domain (662 to 1011 residues) expressed in Escherichia coli BL21(DE3) cells pre-incubated for 30 mins before add...
Ligand InfoPC cidPC sid
In DepthDetails ArticlePubMed
TargetIsoform 2 of Protein mono-ADP-ribosyltransferase PARP3 (Long)(Homo sapiens (Human))
Beigene
US Patent
LigandPNGBDBM207586(US10501467, Example 31 | US9260440, 31 | US9617273...)
Affinity DataIC50: >2.00E+4nM. Assay description: PARP-2 and PARP-3 enzymatic assays were conducted using commercial PARP-2/PARP-3 Chemiluminescent Assay Kit (BPS Biosciences) and the protocols with ...
Ligand InfoPC cidPC sid
In DepthDetails US Patent
TargetPoly [ADP-ribose] polymerase tankyrase-2(Homo sapiens (Human))
Beigene
US Patent
LigandPNGBDBM207586(US10501467, Example 31 | US9260440, 31 | US9617273...)
Affinity DataIC50:  700nM. Assay description: Tankyrase-2 enzymatic assay was conducted using commercial Tankyrase-2 Chemiluminescent Assay Kit (BPS Biosciences) and the protocol with the kit. GS...
Ligand InfoPC cidPC sid
In DepthDetails US Patent
TargetPoly [ADP-ribose] polymerase 1(Homo sapiens (Human))
Beigene
US Patent
LigandPNGBDBM207586(US10501467, Example 31 | US9260440, 31 | US9617273...)
Affinity DataIC50:  2.90E+3nM. Assay description: PARP-1 enzymatic assay was conducted using a method modified from HT F Homogeneous PARP Inhibition Assay Kit (Trevigen). 8.8 nM PARP-1 was pre-incuba...
Ligand InfoPC cidPC sid
In DepthDetails US Patent
TargetPoly [ADP-ribose] polymerase 2(Homo sapiens (Human))
Beigene
US Patent
LigandPNGBDBM207586(US10501467, Example 31 | US9260440, 31 | US9617273...)
Affinity DataIC50:  200nM. Assay description: PARP-2 and PARP-3 enzymatic assays were conducted using commercial PARP-2/PARP-3 Chemiluminescent Assay Kit (BPS Biosciences) and the protocols with ...
Ligand InfoPC cidPC sid
In DepthDetails US Patent
TargetSerine/threonine-protein kinase B-raf [V600E](Homo sapiens (Human))
Beigene
US Patent
LigandPNGBDBM207586(US10501467, Example 31 | US9260440, 31 | US9617273...)
Affinity DataIC50: >2.00E+7nM. Assay description: PARP-2 and PARP-3 enzymatic assays were conducted using commercial PARP-2/PARP-3 Chemiluminescent Assay Kit (BPS Biosciences) and the protocols with ...
Ligand InfoPC cidPC sid
In DepthDetails US Patent
TargetPoly [ADP-ribose] polymerase tankyrase-2(Homo sapiens (Human))
Beigene
US Patent
LigandPNGBDBM207586(US10501467, Example 31 | US9260440, 31 | US9617273...)
Affinity DataIC50:  7.00E+5nM. Assay description: Tankyrase-2 enzymatic assay was conducted using commercial Tankyrase-2 Chemiluminescent Assay Kit (BPS Biosciences) and the protocol with the kit. GS...
Ligand InfoPC cidPC sid
In DepthDetails US Patent
TargetPoly [ADP-ribose] polymerase 1(Homo sapiens (Human))
Beigene
US Patent
LigandPNGBDBM207586(US10501467, Example 31 | US9260440, 31 | US9617273...)
Affinity DataIC50:  2.90E+3nM. Assay description: PARP-1 enzymatic assay was conducted using a method modified from HT F Homogeneous PARP Inhibition Assay Kit (Trevigen). 8.8 nM PARP-1 was pre-incuba...
Ligand InfoPC cidPC sid
In DepthDetails US Patent
TargetPoly [ADP-ribose] polymerase 2(Homo sapiens (Human))
Beigene
US Patent
LigandPNGBDBM207586(US10501467, Example 31 | US9260440, 31 | US9617273...)
Affinity DataIC50:  200nM. Assay description: PARP-2 and PARP-3 enzymatic assays were conducted using commercial PARP-2/PARP-3 Chemiluminescent Assay Kit (BPS Biosciences) and the protocols with ...
Ligand InfoPC cidPC sid
In DepthDetails US Patent
TargetProtein mono-ADP-ribosyltransferase PARP3(Homo sapiens (Human))
Beigene
US Patent
LigandPNGBDBM207586(US10501467, Example 31 | US9260440, 31 | US9617273...)
Affinity DataIC50: >2.00E+7nM. Assay description: PARP-2 and PARP-3 enzymatic assays were conducted using commercial PARP-2/PARP-3 Chemiluminescent Assay Kit (BPS Biosciences) and the protocols with ...
Ligand InfoPC cidPC sid
In DepthDetails US Patent
TargetPoly [ADP-ribose] polymerase tankyrase-2(Homo sapiens (Human))
Beigene
US Patent
LigandPNGBDBM207586(US10501467, Example 31 | US9260440, 31 | US9617273...)
Affinity DataIC50:  7.00E+5nM. Assay description: Tankyrase-2 enzymatic assay was conducted using commercial Tankyrase-2 Chemiluminescent Assay Kit (BPS Biosciences) and the protocol with the kit. GS...
Ligand InfoPC cidPC sid
In DepthDetails US Patent
TargetPoly [ADP-ribose] polymerase 1(Homo sapiens (Human))
Beigene
US Patent
LigandPNGBDBM207586(US10501467, Example 31 | US9260440, 31 | US9617273...)
Affinity DataEC50:  3.20nM. Assay description: Inhibition of PARP-1 in human HeLa cells incubated for 18 hrs in presence of H2O2
Ligand InfoPC cidPC sid
In DepthDetails ArticlePubMed
TargetPoly [ADP-ribose] polymerase 2(Homo sapiens (Human))
Beigene
US Patent
LigandPNGBDBM207586(US10501467, Example 31 | US9260440, 31 | US9617273...)
Affinity DataIC50:  0.200nM. Assay description: Inhibition of PARP-2 (unknown origin) pre-incubated for 30 mins before addition of activated DNA and NAD by chemiluminescent assay
Ligand InfoPC cidPC sid
In DepthDetails ArticlePubMed
TargetPoly [ADP-ribose] polymerase 2(Homo sapiens (Human))
Beigene
US Patent
LigandPNGBDBM207586(US10501467, Example 31 | US9260440, 31 | US9617273...)
Affinity DataIC50:  0.200nM. Assay description: PARP-2 and PARP-3 enzymatic assays were conducted using commercial PARP-2/PARP-3 Chemiluminescent Assay Kit (BPS Biosciences) and the protocols with ...
Ligand InfoPC cidPC sid
In DepthDetails US Patent