BDBM207891 US9266832, Cpd048::US9266832, Cpd084
SMILES Fc1cccc(Cc2ccc(cc2)C(=O)NCCc2c[nH]c3ccc(Cl)cc23)c1
InChI Key InChIKey=YBIHDEVWBQUTNB-UHFFFAOYSA-N
Data  2 EC50
  Tab Delimited (TSV)   2D SDfile   Computed 3D by Vconf -m prep SDfile
Find this compound or compounds like it in BindingDB:
Activity Spreadsheet -- Enzyme Inhibition Constant Data from BindingDB
Found 2 hits for monomerid = 207891
TargetAlpha-synuclein(Homo sapiens (Human))
Katholieke Universiteit Levun
US Patent
LigandPNGBDBM207891(US9266832, Cpd048 | US9266832, Cpd084)
Affinity DataEC50:  26nM. Assay description: α-Synucleinopathies are characterised by aggregation of α-synuclein in neurons. Aggregation of purified α-synuclein is performed essen...
Ligand InfoPC cidPC sid
In DepthDetails US Patent
TargetAlpha-synuclein(Homo sapiens (Human))
Katholieke Universiteit Levun
US Patent
LigandPNGBDBM207891(US9266832, Cpd048 | US9266832, Cpd084)
Affinity DataEC50:  13nM. Assay description: α-Synucleinopathies are characterised by aggregation of α-synuclein in neurons. Aggregation of purified α-synuclein is performed essen...
Ligand InfoPC cidPC sid
In DepthDetails US Patent