BDBM208037 Methyl 3-((4-chlorophenyl)thio)-1-ethyl-5-methyl-1H-indole-2-carboxylate::US9233921, 5
SMILES CCn1c(C(=O)OC)c(Sc2ccc(Cl)cc2)c2cc(C)ccc12
InChI Key InChIKey=UEPUFTDWHWJQIM-UHFFFAOYSA-N
Data  1 IC50
  Tab Delimited (TSV)   2D SDfile   Computed 3D by Vconf -m prep SDfile
Find this compound or compounds like it in BindingDB:
Activity Spreadsheet -- Enzyme Inhibition Constant Data from BindingDB
Found 1 hit for monomerid = 208037
TargetUracil-DNA glycosylase(Vaccinia virus (strain Copenhagen) (VACV))
University Of Pennsylvania
US Patent
LigandPNGBDBM208037(Methyl 3-((4-chlorophenyl)thio)-1-ethyl-5-methyl-1...)
Affinity DataIC50:  3.90E+4nMT: 2°C. Assay description: African green monkey kidney BSC-1 cells were grown in Dulbecco's modified Eagle medium (DMEM) supplemented with 10% fetal bovine serum (FBS) (Gibco B...
Ligand InfoPC cidPC sid
In DepthDetails US Patent