BDBM208103 US9265773, 46
SMILES CNC(=O)c1c(oc2cc(N(C)S(C)(=O)=O)c(cc12)-c1ccc2OCn3c(cc4c(F)cncc34)-c2n1)-c1ccc(F)cc1
InChI Key InChIKey=VHVCWOCFUGQTPW-UHFFFAOYSA-N
Data  2 IC50
  Tab Delimited (TSV)   2D SDfile   Computed 3D by Vconf -m prep SDfile
Find this compound or compounds like it in BindingDB:
Activity Spreadsheet -- Enzyme Inhibition Constant Data from BindingDB
Found 2 hits for monomerid = 208103
TargetGenome polyprotein(Hepatitis C Virus (Virus))
Merck Sharp & Dohme
US Patent
LigandPNGBDBM208103(US9265773, 46)
Affinity DataIC50:  2.10nM. Assay description: Measurement of inhibition by compounds was performed using the HCV replicon system. Several different replicons encoding different HCV genotypes or m...
Ligand InfoPC cidPC sid
In DepthDetails US Patent
TargetGenome polyprotein(Hepatitis C virus (HCV genotype 1a, isolate H))
Merck Sharp & Dohme
US Patent
LigandPNGBDBM208103(US9265773, 46)
Affinity DataIC50:  1.5nM. Assay description: Measurement of inhibition by compounds was performed using the HCV replicon system. Several different replicons encoding different HCV genotypes or m...
Ligand InfoPC cidPC sid
In DepthDetails US Patent