BDBM208827 US9266878, 52a
SMILES C[C@H](Nc1ncnc(N)c1C#Cc1ccc(F)cn1)c1nc2cccc(O)c2c(=O)n1-c1ccccc1
InChI Key InChIKey=UDSUEJHCGOANCP-INIZCTEOSA-N
Data  4 IC50
  Tab Delimited (TSV)   2D SDfile   Computed 3D by Vconf -m prep SDfile
Find this compound or compounds like it in BindingDB:
Activity Spreadsheet -- Enzyme Inhibition Constant Data from BindingDB
Found 4 hits for monomerid = 208827
TargetPhosphatidylinositol 4,5-bisphosphate 3-kinase catalytic subunit beta isoform(Homo sapiens (Human))
Gilead Calistoga
US Patent
LigandPNGBDBM208827(US9266878, 52a)
Affinity DataIC50: >1.00E+3nMpH: 7.4 T: 2°C. Assay description: PI3K isoforms were assayed under initial rate conditions in the presence of 25 mM Hepes (pH 7.4), and 2xKm ATP (100-300 uM), 10 uM PIP2, 5% glycerol,...
Ligand InfoPC cidPC sid
In DepthDetails US Patent
TargetPhosphatidylinositol 4,5-bisphosphate 3-kinase catalytic subunit alpha isoform(Homo sapiens (Human))
Gilead Calistoga
US Patent
LigandPNGBDBM208827(US9266878, 52a)
Affinity DataIC50: >1.00E+3nMpH: 7.4 T: 2°C. Assay description: PI3K isoforms were assayed under initial rate conditions in the presence of 25 mM Hepes (pH 7.4), and 2xKm ATP (100-300 uM), 10 uM PIP2, 5% glycerol,...
Ligand InfoPC cidPC sid
In DepthDetails US Patent
TargetPhosphatidylinositol 4,5-bisphosphate 3-kinase catalytic subunit gamma isoform(Homo sapiens (Human))
Gilead Calistoga
US Patent
LigandPNGBDBM208827(US9266878, 52a)
Affinity DataIC50: >1.00E+3nMpH: 7.4 T: 2°C. Assay description: PI3K isoforms were assayed under initial rate conditions in the presence of 25 mM Hepes (pH 7.4), and 2xKm ATP (100-300 uM), 10 uM PIP2, 5% glycerol,...
Ligand InfoPC cidPC sid
In DepthDetails US Patent
TargetPhosphatidylinositol 4,5-bisphosphate 3-kinase catalytic subunit delta isoform(Homo sapiens (Human))
Gilead Calistoga
US Patent
LigandPNGBDBM208827(US9266878, 52a)
Affinity DataIC50: <100nMpH: 7.4 T: 2°C. Assay description: PI3K isoforms were assayed under initial rate conditions in the presence of 25 mM Hepes (pH 7.4), and 2xKm ATP (100-300 uM), 10 uM PIP2, 5% glycerol,...
Ligand InfoPC cidPC sid
In DepthDetails US Patent