BDBM20899 5-(5-chloro-2,4-dihydroxyphenyl)-N-ethyl-4-(4-methoxyphenyl)-1,2-oxazole-3-carboxamide::CHEMBL252124::Isoxazole, 33
SMILES CCNC(=O)c1noc(c1-c1ccc(OC)cc1)-c1cc(Cl)c(O)cc1O
InChI Key InChIKey=JXPCDMPJCKNLBY-UHFFFAOYSA-N
Data  2 IC50  1 EC50
PDB links: 1 PDB ID matches this monomer.
  Tab Delimited (TSV)   2D SDfile   Computed 3D by Vconf -m prep SDfile
Find this compound or compounds like it in BindingDB:
Activity Spreadsheet -- Enzyme Inhibition Constant Data from BindingDB
Found 2 hits for monomerid = 20899
TargetHeat shock protein HSP 90-beta(Homo sapiens (Human))
Memorial Sloan-Kettering Cancer Center
Curated by ChEMBL
LigandPNGBDBM20899(5-(5-chloro-2,4-dihydroxyphenyl)-N-ethyl-4-(4-meth...)
Affinity DataIC50:  28nM. Assay description: Binding affinity to Hsp90 by fluorescence polarization assay
TargetHeat shock protein HSP 90-beta(Homo sapiens (Human))
Memorial Sloan-Kettering Cancer Center
Curated by ChEMBL
LigandPNGBDBM20899(5-(5-chloro-2,4-dihydroxyphenyl)-N-ethyl-4-(4-meth...)
Affinity DataIC50:  28nM EC50:  120nMpH: 7.4 T: 2°C. Assay description: The assay is based upon displacement of a fluorescently labeled molecule, which binds specifically to the ATP-binding site of full-length human Hsp90...