BDBM209517 US9271969, 5
SMILES OC(=O)C[C@H]1CCC(CC1)c1ccc(cc1)-c1ccc2nc(cn2c1)C(=O)Nc1cccc(OC(F)(F)F)c1
InChI Key InChIKey=BNRPWAHQXKWWJD-NZANSXMDSA-N
Data  2 IC50
  Tab Delimited (TSV)   2D SDfile   Computed 3D by Vconf -m prep SDfile
Find this compound or compounds like it in BindingDB:
Activity Spreadsheet -- Enzyme Inhibition Constant Data from BindingDB
Found 2 hits for monomerid = 209517
TargetDiacylglycerol O-acyltransferase 1(Mus musculus (mouse))
Kainos Medicine
US Patent
LigandPNGBDBM209517(US9271969, 5)
Affinity DataIC50: <125nMpH: 7.4 T: 2°C. Assay description:  Assay buffer [20 mM HEPES (pH 7.4), 100 mM MgCl2 and 0.04% bovine serum albumin (BSA)] containing 500 uM of enzyme substrate (didecanoyl glycerol) ...
Ligand InfoPC cidPC sid
In DepthDetails US Patent
TargetDiacylglycerol O-acyltransferase 1(Homo sapiens (Human))
Kainos Medicine
US Patent
LigandPNGBDBM209517(US9271969, 5)
Affinity DataIC50: <100nMpH: 7.4 T: 2°C. Assay description:  Assay buffer [20 mM HEPES (pH 7.4), 100 mM MgCl2 and 0.04% bovine serum albumin (BSA)] containing 500 uM of enzyme substrate (didecanoyl glycerol) ...
Ligand InfoPC cidPC sid
In DepthDetails US Patent