BDBM209752 US9273033, 52
SMILES COc1ccc(nc1)[C@H]1C[C@@H]1COc1nc(C)ncc1-c1ccc(=O)n(CC(F)(F)F)c1
InChI Key InChIKey=FINQEFXUNVKEHV-WBVHZDCISA-N
Data  1 KI
  Tab Delimited (TSV)   2D SDfile   Computed 3D by Vconf -m prep SDfile
Find this compound or compounds like it in BindingDB:
Activity Spreadsheet -- Enzyme Inhibition Constant Data from BindingDB
Found 1 hit for monomerid = 209752
TargetcAMP and cAMP-inhibited cGMP 3',5'-cyclic phosphodiesterase 10A(Homo sapiens (Human))
Merck Sharp & Dohme
US Patent
LigandPNGBDBM209752(US9273033, 52)
Affinity DataKi:  3.11nM ΔG°:  -11.6kcal/moleT: 2°C. Assay description: The fluorescence polarization assay for cyclic nucleotide phosphodiesterases was performed using an IMAP FP kit supplied by Molecular Devices, Sunnyv...
Ligand InfoPC cidPC sid
In DepthDetails US Patent