BDBM209798 US9273033, 98
SMILES COc1ccc(nc1)[C@H]1C[C@@H]1COc1nc(C)ncc1-c1cc(=O)n(C)cc1S(C)(=O)=O
InChI Key InChIKey=YTYZHWFTABSGMX-ZBFHGGJFSA-N
Data  1 KI
  Tab Delimited (TSV)   2D SDfile   Computed 3D by Vconf -m prep SDfile
Find this compound or compounds like it in BindingDB:
Activity Spreadsheet -- Enzyme Inhibition Constant Data from BindingDB
Found 1 hit for monomerid = 209798
TargetcAMP and cAMP-inhibited cGMP 3',5'-cyclic phosphodiesterase 10A(Homo sapiens (Human))
Merck Sharp & Dohme
US Patent
LigandPNGBDBM209798(US9273033, 98)
Affinity DataKi:  67.5nM ΔG°:  -9.78kcal/moleT: 2°C. Assay description: The fluorescence polarization assay for cyclic nucleotide phosphodiesterases was performed using an IMAP FP kit supplied by Molecular Devices, Sunnyv...
Ligand InfoPC cidPC sid
In DepthDetails US Patent