BDBM209870 US9273014, 1
SMILES Cc1cccc2c1NC(=O)[C@@H](NC(=O)[C@H](CCC(F)(F)F)[C@H](CCC(F)(F)F)C(N)=O)N=C2c1cccc(F)c1
InChI Key InChIKey=SRJNRAQUSAVENA-GSHUGGBRSA-N
Data  2 IC50
  Tab Delimited (TSV)   2D SDfile   Computed 3D by Vconf -m prep SDfile
Find this compound or compounds like it in BindingDB:
Activity Spreadsheet -- Enzyme Inhibition Constant Data from BindingDB
Found 2 hits for monomerid = 209870
TargetNeurogenic locus notch homolog protein 3(Homo sapiens (Human))
Bristol-Myers Squibb
US Patent
LigandPNGBDBM209870(US9273014, 1)
Affinity DataIC50:  8.5nM. Assay description: The pharmacological properties of the compounds of this invention may be confirmed by a number of biological assays.
In DepthDetails US Patent
TargetNeurogenic locus notch homolog protein 1(Homo sapiens (Human))
Bristol-Myers Squibb
US Patent
LigandPNGBDBM209870(US9273014, 1)
Affinity DataIC50:  7.80nM. Assay description: The pharmacological properties of the compounds of this invention may be confirmed by a number of biological assays.
In DepthDetails US Patent