BDBM209897 US9273014, 26
SMILES COc1cccc2c1NC(=O)[C@@H](NC(=O)[C@H](CCC(F)(F)F)[C@H](CCC(F)(F)F)C(N)=O)N=C2c1cccc(Cl)c1
InChI Key InChIKey=BQJHUPVEKBVMDC-WJONJSRFSA-N
Data  2 IC50
  Tab Delimited (TSV)   2D SDfile   Computed 3D by Vconf -m prep SDfile
Find this compound or compounds like it in BindingDB:
Activity Spreadsheet -- Enzyme Inhibition Constant Data from BindingDB
Found 2 hits for monomerid = 209897
TargetNeurogenic locus notch homolog protein 3(Homo sapiens (Human))
Bristol-Myers Squibb
US Patent
LigandPNGBDBM209897(US9273014, 26)
Affinity DataIC50:  3.40nM. Assay description: The pharmacological properties of the compounds of this invention may be confirmed by a number of biological assays.
Ligand InfoPC cidPC sid
In DepthDetails US Patent
TargetNeurogenic locus notch homolog protein 1(Homo sapiens (Human))
Bristol-Myers Squibb
US Patent
LigandPNGBDBM209897(US9273014, 26)
Affinity DataIC50:  3.70nM. Assay description: The pharmacological properties of the compounds of this invention may be confirmed by a number of biological assays.
Ligand InfoPC cidPC sid
In DepthDetails US Patent