BDBM209914 US9273042, 2
SMILES C[C@]1(CS(=O)(=O)CC(N)=N1)c1cc(NC(=O)c2ccc(cn2)C#N)ccc1F
InChI Key InChIKey=RGEUASSNKIFBFX-SFHVURJKSA-N
Data  1 IC50
  Tab Delimited (TSV)   2D SDfile   Computed 3D by Vconf -m prep SDfile
Find this compound or compounds like it in BindingDB:
Activity Spreadsheet -- Enzyme Inhibition Constant Data from BindingDB
Found 1 hit for monomerid = 209914
TargetBeta-secretase 1(Homo sapiens (Human))
Hoffmann-La Roche
US Patent
LigandPNGBDBM209914(US9273042, 2)
Affinity DataIC50:  0.00820nMT: 2°C. Assay description: The Abeta 40 AlphaLISA Assay can be used. The HEK293 APP cells were seeded in 96 well Microtiter plates in cell culture medium (Iscove's, plus 10% (v...
Ligand InfoPC cidPC sid
In DepthDetails US Patent