BDBM210080 US9270353, 32
SMILES C[C@]1(C=CSC(N)=N1)c1cc(NC(=O)c2ccc(OCCF)cn2)ccc1F
InChI Key InChIKey=LHHOGWNCFIQLHU-IBGZPJMESA-N
Data  1 IC50
  Tab Delimited (TSV)   2D SDfile   Computed 3D by Vconf -m prep SDfile
Find this compound or compounds like it in BindingDB:
Activity Spreadsheet -- Enzyme Inhibition Constant Data from BindingDB
Found 1 hit for monomerid = 210080
TargetBeta-secretase 1(Homo sapiens (Human))
Shionogi
US Patent
LigandPNGBDBM210080(US9270353, 32)
Affinity DataIC50: <1.00E+3nMpH: 5.0Assay Description:48.5 μL of substrate peptide solution (Biotin-XSEVNLDAEFRHDSGC-Eu: X=ε-amino-n-capronic acid, Eu=Europium cryptate) was added to each well ...
Ligand InfoPC cidPC sid
In DepthDetails US Patent