BDBM210510 US9290451, 222
SMILES CN(C)C(=O)[C@H](CC1CC1)NC(=O)c1ccc(C2CC2)c(OCC2CC2)n1
InChI Key InChIKey=OLPGTIYHMRKFBU-SFHVURJKSA-N
Data  2 EC50
  Tab Delimited (TSV)   2D SDfile   Computed 3D by Vconf -m prep SDfile
Find this compound or compounds like it in BindingDB:
Activity Spreadsheet -- Enzyme Inhibition Constant Data from BindingDB
Found 2 hits for monomerid = 210510
TargetCannabinoid receptor 1(Homo sapiens (Human))
Hoffmann-La Roche
US Patent
LigandPNGBDBM210510(US9290451, 222)
Affinity DataEC50: >1.00E+4nMT: 2°C. Assay description: CHO cells expressing human CB1 or CB2 receptors are seeded 17-24 hours prior to the experiment 50.000 cells per well in a black 96 well plate with fl...
Ligand InfoPC cidPC sid
In DepthDetails US Patent
TargetCannabinoid receptor 2(Homo sapiens (Human))
Hoffmann-La Roche
US Patent
LigandPNGBDBM210510(US9290451, 222)
Affinity DataEC50:  3.20nMT: 2°C. Assay description: CHO cells expressing human CB1 or CB2 receptors are seeded 17-24 hours prior to the experiment 50.000 cells per well in a black 96 well plate with fl...
Ligand InfoPC cidPC sid
In DepthDetails US Patent