BDBM210964 2-(((1r,4r)-4-hydroxycyclohexyl)amino)-4-(2-(pyridin-2-ylmethyl)-1H-pyrrol-1-yl)benzamide (8o)::US10975030, Compound 8o
SMILES NC(=O)c1ccc(cc1NC1CCC(O)CC1)-n1cccc1Cc1ccccn1
InChI Key InChIKey=OMRABLBYYVNFNV-UHFFFAOYSA-N
Data  3 Kd
  Tab Delimited (TSV)   2D SDfile   Computed 3D by Vconf -m prep SDfile
Find this compound or compounds like it in BindingDB:
Activity Spreadsheet -- Enzyme Inhibition Constant Data from BindingDB
Found 3 hits for monomerid = 210964
TargetEndoplasmin(Homo sapiens (Human))
The University Of Kansas
LigandPNGBDBM210964(2-(((1r,4r)-4-hydroxycyclohexyl)amino)-4-(2-(pyrid...)
Affinity DataKd:  1.40E+4nMpH: 7.3Assay Description:Assay buffer (25 μL, 20 mM HEPES at pH 7.3, 50 mM KCl, 5 mM MgCl2, 1 mM DTT, 20 mM Na2MoO4, 0.01% NP-40, and 0.5 mg mL−1 BGG) was added to...
Ligand InfoPC cidPC sid
In DepthDetails ArticlePubMed
TargetHeat shock protein HSP 90-alpha(Homo sapiens (Human))
University Of Kansas
US Patent
LigandPNGBDBM210964(2-(((1r,4r)-4-hydroxycyclohexyl)amino)-4-(2-(pyrid...)
Affinity DataKd: >1.00E+5nM. Assay description: Assay buffer (25 μL, 20 mM HEPES pH 7.3, 50 mM KCl, 5 mM MgCl2, 1 mM DTT, 20 mM Na2MoO4, 0.01% NP-40, and 0.5 mg/mL BGG) was added to 96-well pl...
Ligand InfoPC cidPC sid
In DepthDetails US Patent
TargetHeat shock protein HSP 90-alpha(Homo sapiens (Human))
University Of Kansas
US Patent
LigandPNGBDBM210964(2-(((1r,4r)-4-hydroxycyclohexyl)amino)-4-(2-(pyrid...)
Affinity DataKd: >1.00E+5nMpH: 7.3Assay Description:Assay buffer (25 μL, 20 mM HEPES at pH 7.3, 50 mM KCl, 5 mM MgCl2, 1 mM DTT, 20 mM Na2MoO4, 0.01% NP-40, and 0.5 mg mL−1 BGG) was added to...
Ligand InfoPC cidPC sid
In DepthDetails ArticlePubMed