BDBM211129 US9546153, ex. 524
SMILES CC(C)Nc1cc(Nc2ccc3ncsc3c2)ncc1C(=O)NC1CCC(O)(CC1)c1ccnn1C
InChI Key InChIKey=XFEIZKVKYMHMHK-UHFFFAOYSA-N
Data  1 IC50
  Tab Delimited (TSV)   2D SDfile   Computed 3D by Vconf -m prep SDfile
Find this compound or compounds like it in BindingDB:
Activity Spreadsheet -- Enzyme Inhibition Constant Data from BindingDB
Found 1 hit for monomerid = 211129
TargetInterleukin-1 receptor-associated kinase 4(Homo sapiens (Human))
Bristol-Myers Squibb
US Patent
LigandPNGBDBM211129(US9546153, ex. 524)
Affinity DataIC50:  3.70nMpH: 7.2 T: 2°C. Assay description: The assays were performed in U-bottom 384-well plates. The final assay volume was 30 μL prepared from 15 μL additions of enzyme and substra...
Ligand InfoPC cidPC sid
In DepthDetails US Patent