BDBM211179 US9247759, 5-126
SMILES Cc1ccc(CN(CC2CCC(CC2)C(O)=O)S(=O)(=O)c2ccc(C)cc2)cc1
InChI Key InChIKey=ACDYGEWRZMOQTR-UHFFFAOYSA-N
Data  1 IC50
  Tab Delimited (TSV)   2D SDfile   Computed 3D by Vconf -m prep SDfile
Find this compound or compounds like it in BindingDB:
Activity Spreadsheet -- Enzyme Inhibition Constant Data from BindingDB
Found 1 hit for monomerid = 211179
TargetTaste receptor type 2 member 14(Homo sapiens (Human))
Senomyx
US Patent
LigandPNGBDBM211179(US9247759, 5-126)
Affinity DataIC50:  109nM. Assay description: In another embodiment, Fluorescence Polarization ("FP") based assays may be used to detect and monitor ligand binding. Fluorescence polarization is a...
Ligand InfoPC cidPC sid
In DepthDetails US Patent