BDBM211613 US9290457, Example 3.54
SMILES CCOC(=O)C1=C(C)N(C(=O)N(C)C1c1ccc(cc1C(=O)N1CC[C@H](C1)NC(C)=O)C#N)c1cccc(c1)C(F)(F)F
InChI Key InChIKey=AFBGZMGNXYWTTI-OSMGYRLQSA-N
Data  1 IC50
  Tab Delimited (TSV)   2D SDfile   Computed 3D by Vconf -m prep SDfile
Find this compound or compounds like it in BindingDB:
Activity Spreadsheet -- Enzyme Inhibition Constant Data from BindingDB
Found 1 hit for monomerid = 211613
TargetNeutrophil elastase(Homo sapiens (Human))
Boehringer Ingelheim International
US Patent
LigandPNGBDBM211613(US9290457, Example 3.54)
Affinity DataIC50: <1nMpH: 7.5 T: 2°C. Assay description: Materials: Human neutrophil elastase was purchased from Calbiochem (Cat. No.: 324681) and the elastase substrate MeOSuc-Ala-Ala-Pro-Val-AMC from Bach...
Ligand InfoPC cidPC sid
In DepthDetails US Patent