BDBM211965 US9290482, 5
SMILES C(Oc1ccc2ncc(-c3cc4ncccc4o3)n2n1)[C@H]1CNCCO1
InChI Key InChIKey=IDWSMFWRDJCZMC-GFCCVEGCSA-N
Data  1 IC50
  Tab Delimited (TSV)   2D SDfile   Computed 3D by Vconf -m prep SDfile
Find this compound or compounds like it in BindingDB:
Activity Spreadsheet -- Enzyme Inhibition Constant Data from BindingDB
Found 1 hit for monomerid = 211965
TargetIsoform 2 of MAP kinase-interacting serine/threonine-protein kinase 1 (MNK1a) 344D](Homo sapiens (Human))
Bayer Pharma Aktiengesellschaft
US Patent
LigandPNGBDBM211965(US9290482, 5)
Affinity DataIC50:  86nMpH: 7.5 T: 2°C. Assay description: For the assay 50 nl nL of a 100fold concentrated solution of the test compound in DMSO was pipetted into a black low volume 384well microtiter plate ...
Ligand InfoPC cidPC sid
In DepthDetails US Patent