BDBM21219 12-methyl-10-thia-1,4,5,6,8-pentaazatricyclo[7.3.0.0^{3,7}]dodeca-3(7),4,8-trien-2-one::7-methyl-6,7-dihydro[1,3]thiazolo[3,2-a][1,2,3]triazolo[4,5-d]pyrimidin-9(3H)-one::CHEMBL445664::triazolopyrimidinone, E
SMILES CC1CSc2nc3nn[nH]c3c(=O)n12
InChI Key InChIKey=WBHQTBNEJTXXLN-UHFFFAOYSA-N
Data  6 KI
  Tab Delimited (TSV)   2D SDfile   Computed 3D by Vconf -m prep SDfile
Find this compound or compounds like it in BindingDB:
Activity Spreadsheet -- Enzyme Inhibition Constant Data from BindingDB
Found 6 hits for monomerid = 21219
TargetAdenosine receptor A3(Homo sapiens (Human))
Universita Di Napoli
LigandPNGBDBM21219(12-methyl-10-thia-1,4,5,6,8-pentaazatricyclo[7.3.0...)
Affinity DataKi:  440nM. Assay description: The membranes prepared from CHO cells transfected with human adenosine A3 receptors were used in binding assays. Nonspecific binding was determined i...
In DepthDetails ArticlePubMed
TargetAdenosine receptor A3(Homo sapiens (Human))
Universita Di Napoli
LigandPNGBDBM21219(12-methyl-10-thia-1,4,5,6,8-pentaazatricyclo[7.3.0...)
Affinity DataKi:  440nM. Assay description: Displacement of [125I]AB-MECA from human adenosine A3 receptor expressed in CHO cells
In DepthDetails ArticlePubMed
TargetAdenosine receptor A1(Homo sapiens (Human))
Universit£
Curated by ChEMBL
LigandPNGBDBM21219(12-methyl-10-thia-1,4,5,6,8-pentaazatricyclo[7.3.0...)
Affinity DataKi: >1.00E+4nM. Assay description: Displacement of [3H]DPCPX from human adenosine A1 receptor expressed in CHO cells
In DepthDetails ArticlePubMed
TargetAdenosine receptor A2a(Homo sapiens (Human))
Universit£
Curated by ChEMBL
LigandPNGBDBM21219(12-methyl-10-thia-1,4,5,6,8-pentaazatricyclo[7.3.0...)
Affinity DataKi: >1.00E+4nM. Assay description: Displacement of [3H]NECA from human adenosine A2A receptor expressed in CHO cells
In DepthDetails ArticlePubMed
TargetAdenosine receptor A2a(Homo sapiens (Human))
Universit£
Curated by ChEMBL
LigandPNGBDBM21219(12-methyl-10-thia-1,4,5,6,8-pentaazatricyclo[7.3.0...)
Affinity DataKi: >1.00E+4nM. Assay description: The membranes prepared from CHO cells transfected with human adenosine A2A receptors were used in binding assays. Nonspecific binding was determined ...
In DepthDetails ArticlePubMed
TargetAdenosine receptor A1(Homo sapiens (Human))
Universit£
Curated by ChEMBL
LigandPNGBDBM21219(12-methyl-10-thia-1,4,5,6,8-pentaazatricyclo[7.3.0...)
Affinity DataKi: >1.00E+4nM ΔG°: >-6.82kcal/molepH: 7.4 T: 2°C. Assay description: The membranes prepared from CHO cells transfected with human adenosine A1 receptors were used in binding assays. Nonspecific binding was determined i...
In DepthDetails ArticlePubMed