BDBM21229 2-mercaptopyrimidine analogue, 5h::N-[6-propoxy-2-(propylsulfanyl)pyrimidin-4-yl]propanamide
SMILES CCCOc1cc(NC(=O)CC)nc(SCCC)n1
InChI Key InChIKey=LDWFVJJZFOZGAM-UHFFFAOYSA-N
Data  3 KI
  Tab Delimited (TSV)   2D SDfile   Computed 3D by Vconf -m prep SDfile
Find this compound or compounds like it in BindingDB:
Activity Spreadsheet -- Enzyme Inhibition Constant Data from BindingDB
Found 3 hits for monomerid = 21229
TargetAdenosine receptor A3(Homo sapiens (Human))
Universita Di Napoli
LigandPNGBDBM21229(2-mercaptopyrimidine analogue, 5h | N-[6-propoxy-2...)
Affinity DataKi:  38nM. Assay description: The membranes prepared from CHO cells transfected with human adenosine A3 receptors were used in binding assays. Nonspecific binding was determined i...
In DepthDetails ArticlePubMed
TargetAdenosine receptor A2a(Homo sapiens (Human))
Universita Di Napoli
LigandPNGBDBM21229(2-mercaptopyrimidine analogue, 5h | N-[6-propoxy-2...)
Affinity DataKi:  71nM. Assay description: The membranes prepared from CHO cells transfected with human adenosine A2A receptors were used in binding assays. Nonspecific binding was determined ...
In DepthDetails ArticlePubMed
TargetAdenosine receptor A1(Homo sapiens (Human))
Universita Di Napoli
LigandPNGBDBM21229(2-mercaptopyrimidine analogue, 5h | N-[6-propoxy-2...)
Affinity DataKi:  1.46E+3nM ΔG°:  -7.95kcal/molepH: 7.4 T: 2°C. Assay description: The membranes prepared from CHO cells transfected with human adenosine A1 receptors were used in binding assays. Nonspecific binding was determined i...
In DepthDetails ArticlePubMed