BDBM212485 US10155731, Example 39::US9278944, 39
SMILES COCCCn1nc(C)c2c(Cl)cc(cc12)[C@@H](C)N(C1CC1)C(=O)[C@H]1CNCCO1
InChI Key InChIKey=FUZDMPHNVOBBHN-FOIQADDNSA-N
Data  2 IC50
  Tab Delimited (TSV)   2D SDfile   Computed 3D by Vconf -m prep SDfile
Find this compound or compounds like it in BindingDB:
Activity Spreadsheet -- Enzyme Inhibition Constant Data from BindingDB
Found 2 hits for monomerid = 212485
TargetRenin(Homo sapiens (Human))
Mitsubishi Tanabe Pharma
US Patent
LigandPNGBDBM212485(US10155731, Example 39 | US9278944, 39)
Affinity DataIC50:  1.40nM. Assay description: A substrate of synthetic peptide (Nma-KHPFH LVIHK(Dnp)-NH2) and test compound were mixed, and fluorescence intensity was assayed using a fluorophotom...
Ligand InfoPC cidPC sid
In DepthDetails US Patent
TargetRenin(Homo sapiens (Human))
Mitsubishi Tanabe Pharma
US Patent
LigandPNGBDBM212485(US10155731, Example 39 | US9278944, 39)
Affinity DataIC50:  1.40nM. Assay description: A substrate of synthetic peptide (Nma-KHPFHLVIHK(Dnp)-NH2) and test compound were mixed, and fluorescence intensity was assayed using a fluorophotome...
Ligand InfoPC cidPC sid
In DepthDetails US Patent