BDBM212650 US9278954, 1.41
SMILES CCCNc1nccc(N2CC[C@H](C2)Oc2ccc(cc2)C(C)C(=O)NC2CCC2)c1F
InChI Key InChIKey=KQWQPJBHWLXEBR-FBLFFUNLSA-N
Data  1 IC50
  Tab Delimited (TSV)   2D SDfile   Computed 3D by Vconf -m prep SDfile
Find this compound or compounds like it in BindingDB:
Activity Spreadsheet -- Enzyme Inhibition Constant Data from BindingDB
Found 1 hit for monomerid = 212650
TargetAcetyl-CoA carboxylase 2 [129-967](Homo sapiens (Human))
Boehringer Ingelheim International
US Patent
LigandPNGBDBM212650(US9278954, 1.41)
Affinity DataIC50:  438nMpH: 7.5Assay Description:Malonyl CoA formation by acetyl CoA carboxylases is stoichometrically linked to the consumption of ATP. ACC2 activity is measured in a NADH-linked ki...
Ligand InfoPC cidPC sid
In DepthDetails US Patent