BDBM212935 6-{[(1r)-1- cyclobutylethyl]amino}- 8-(4-cyclopropylpyridin- 2-yl)-7-[4- (trifluoromethyl)benzyl]- 7h-purine-2-carboxylic acid::US9540377, 1.51
SMILES C[C@@H](Nc1nc(nc2nc(-c3cc(ccn3)C3CC3)n(Cc3ccc(cc3)C(F)(F)F)c12)C(O)=O)C1CCC1
InChI Key InChIKey=MYVJLTOWLXPJPK-OAHLLOKOSA-N
Data  1 IC50
  Tab Delimited (TSV)   2D SDfile   Computed 3D by Vconf -m prep SDfile
Find this compound or compounds like it in BindingDB:
Activity Spreadsheet -- Enzyme Inhibition Constant Data from BindingDB
Found 1 hit for monomerid = 212935
TargetE3 ubiquitin-protein ligase Mdm2 [17-125](Homo sapiens (Human))
Merck Sharp & Dohme
US Patent
LigandPNGBDBM212935(6-{[(1r)-1- cyclobutylethyl]amino}- 8-(4-cycloprop...)
Affinity DataIC50:  8.39nMT: 2°C. Assay description: An HDM2 FRET assay was developed to assess the compounds' inhibitory activity towards binding of p53 protein. A truncated version of HDM2 with re...
Ligand InfoPC cidPC sid
In DepthDetails US Patent