BDBM21334 1-(oxan-4-ylmethyl)-6-phenyl-3-[(2,2,3,3-tetramethylcyclopropyl)carbonyl]-1H-indole::Tetrahydropyranyl-methyl analogue, 55
SMILES CC1(C)C(C(=O)c2cn(CC3CCOCC3)c3cc(ccc23)-c2ccccc2)C1(C)C
InChI Key InChIKey=YMSCAKAZSHMHCT-UHFFFAOYSA-N
Data  4 KI  1 EC50
  Tab Delimited (TSV)   2D SDfile   Computed 3D by Vconf -m prep SDfile
Find this compound or compounds like it in BindingDB:
Activity Spreadsheet -- Enzyme Inhibition Constant Data from BindingDB
Found 4 hits for monomerid = 21334
TargetCannabinoid receptor 2(Homo sapiens (Human))
Universit£
Curated by ChEMBL
LigandPNGBDBM21334(1-(oxan-4-ylmethyl)-6-phenyl-3-[(2,2,3,3-tetrameth...)
Affinity DataKi:  0.400nM. Assay description: Displacement of [3H]CP 55940 from human CB2 receptor in cell free system
In DepthDetails ArticlePubMed
TargetCannabinoid receptor 2(Homo sapiens (Human))
Universit£
Curated by ChEMBL
LigandPNGBDBM21334(1-(oxan-4-ylmethyl)-6-phenyl-3-[(2,2,3,3-tetrameth...)
Affinity DataKi:  0.410nM EC50: >1.00E+4nM. Assay description: IC50 values for test compounds were determined from nonlinear regression analysis of data collected from ligand binding experiments. The inhibition c...
In DepthDetails ArticlePubMed
TargetCannabinoid receptor 1(Homo sapiens (Human))
Abbott Laboratories
LigandPNGBDBM21334(1-(oxan-4-ylmethyl)-6-phenyl-3-[(2,2,3,3-tetrameth...)
Affinity DataKi:  228nM. Assay description: IC50 values for test compounds were determined from nonlinear regression analysis of data collected from ligand binding experiments. The inhibition c...
In DepthDetails ArticlePubMed
TargetCannabinoid receptor 1(Homo sapiens (Human))
Abbott Laboratories
LigandPNGBDBM21334(1-(oxan-4-ylmethyl)-6-phenyl-3-[(2,2,3,3-tetrameth...)
Affinity DataKi:  228nM. Assay description: Displacement of [3H]CP 55940 from human CB1 receptor in cell free system
In DepthDetails ArticlePubMed