BDBM213464 US9278981, 56
SMILES COc1ccc(cn1)-c1cc(cnc1N1CC[C@@H](O)C1)C(=O)Nc1ccc(OC(F)(F)F)cc1
InChI Key InChIKey=FHCTVOWBKSMPQX-QGZVFWFLSA-N
Data  1 IC50
  Tab Delimited (TSV)   2D SDfile   Computed 3D by Vconf -m prep SDfile
Find this compound or compounds like it in BindingDB:
Activity Spreadsheet -- Enzyme Inhibition Constant Data from BindingDB
Found 1 hit for monomerid = 213464
TargetTyrosine-protein kinase ABL1 [64-515](Homo sapiens (Human))
Novartis
US Patent
LigandPNGBDBM213464(US9278981, 56)
Affinity DataIC50:  4nMpH: 7.5 T: 2°C. Assay description: For determination of ABL kinase activity, the radiometric filter-binding assay was used. The assay was performed by mixing 10 uL of the compound pre-...
Ligand InfoPC cidPC sid
In DepthDetails US Patent