BDBM213631 US9278981, 223
SMILES N[C@@]1(CCN(C1)c1ncc(cc1-c1cncnc1)C(=O)Nc1ccc(OC(F)(F)F)cc1)C(F)(F)F
InChI Key InChIKey=INKNUGGIAWKOGM-HXUWFJFHSA-N
Data  2 IC50
  Tab Delimited (TSV)   2D SDfile   Computed 3D by Vconf -m prep SDfile
Find this compound or compounds like it in BindingDB:
Activity Spreadsheet -- Enzyme Inhibition Constant Data from BindingDB
Found 2 hits for monomerid = 213631
TargetTyrosine-protein kinase ABL1 [64-515](Homo sapiens (Human))
Novartis
US Patent
LigandPNGBDBM213631(US9278981, 223)
Affinity DataIC50:  10nMpH: 7.5 T: 2°C. Assay description: The assay plates were prepared by addition of 50 nL per well of compound solution in 90% DMSO. The kinase reactions were started by stepwise addition...
Ligand InfoPC cidPC sid
In DepthDetails US Patent
TargetTyrosine-protein kinase ABL1 [64-515](Homo sapiens (Human))
Novartis
US Patent
LigandPNGBDBM213631(US9278981, 223)
Affinity DataIC50:  0.200nMpH: 7.5 T: 2°C. Assay description: For determination of ABL kinase activity, the radiometric filter-binding assay was used. The assay was performed by mixing 10 uL of the compound pre-...
Ligand InfoPC cidPC sid
In DepthDetails US Patent