BDBM213743 US9284298, 8
SMILES CCc1cccc(CC)c1NC(=O)c1cc(-c2ccnc(Nc3ccc(cc3OC)N3CCN(CCO)CC3)n2)n(C)n1
InChI Key InChIKey=ZFRAYIYRRCRCJI-UHFFFAOYSA-N
Data  1 IC50
  Tab Delimited (TSV)   2D SDfile   Computed 3D by Vconf -m prep SDfile
Find this compound or compounds like it in BindingDB:
Activity Spreadsheet -- Enzyme Inhibition Constant Data from BindingDB
Found 1 hit for monomerid = 213743
TargetDual specificity protein kinase TTK [2-857](Homo sapiens (Human))
Nerviano Medical Sciences
US Patent
LigandPNGBDBM213743(US9284298, 8)
Affinity DataIC50: <200nMpH: 7.5Assay Description:The inhibitory activity of putative kinase inhibitors and the potency of selected compounds were determined using a trans-phosphorylation assay. Spec...
Ligand InfoPC cidPC sid
In DepthDetails US Patent