BDBM21497 4-[2-(6-methylpyridin-2-yl)-4H,5H,6H-pyrrolo[1,2-a]pyrazol-3-yl]-6-(trifluoromethoxy)quinoline::Dihydropyrrolopyrazole, 7f
SMILES Cc1cccc(n1)-c1nn2CCCc2c1-c1ccnc2ccc(OC(F)(F)F)cc12
InChI Key InChIKey=SRIWDROQQPUKBC-UHFFFAOYSA-N
Data  1 IC50  1 EC50
  Tab Delimited (TSV)   2D SDfile   Computed 3D by Vconf -m prep SDfile
Find this compound or compounds like it in BindingDB:
Activity Spreadsheet -- Enzyme Inhibition Constant Data from BindingDB
Found 1 hit for monomerid = 21497
TargetTGF-beta receptor type-1 [4-503,T204D](Homo sapiens (Human))
Eli Lilly
LigandPNGBDBM21497(4-[2-(6-methylpyridin-2-yl)-4H,5H,6H-pyrrolo[1,2-a...)
Affinity DataIC50:  141nM EC50:  201nMpH: 7.5 T: 2°C. Assay description: The kinase activity was assayed by the autophosphorylation reaction of ALK5 (T204D) in the presence of 4 uM ATP and [33P]-gamma-ATP. After incubation...
In DepthDetails ArticlePubMed