BDBM21567 2-{5-chloro-1'-[(4-fluorophenyl)methyl]-1,2-dihydrospiro[indole-3,3'-pyrrolidine]-2,2',5'-trione}acetic acid::Spiro-indolinone analogue, 59
SMILES OC(=O)CN1C(=O)C2(CC(=O)N(Cc3ccc(F)cc3)C2=O)c2cc(Cl)ccc12
InChI Key InChIKey=YTCBTHYXIOAOBE-UHFFFAOYSA-N
Data  1 KI  1 EC50
  Tab Delimited (TSV)   2D SDfile   Computed 3D by Vconf -m prep SDfile
Find this compound or compounds like it in BindingDB:
Activity Spreadsheet -- Enzyme Inhibition Constant Data from BindingDB
Found 1 hit for monomerid = 21567
TargetProstaglandin D2 receptor 2(Homo sapiens (Human))
Merck Serono
LigandPNGBDBM21567(2-{5-chloro-1'-[(4-fluorophenyl)methyl]-1,2-dihydr...)
Affinity DataKi:  96nM ΔG°:  -9.47kcal/mole EC50:  182nMpH: 7.4 T: 2°C. Assay description: A scintillation proximity assay was used for radioligand competition and saturation binding assays. Nonspecific binding was determined in the presenc...
In DepthDetails ArticlePubMed