BDBM215671 US9296748, I-7
SMILES CN1CCN(CC1)c1ccc2nc(-c3c[nH]c(=O)c(C)c3)n(Cc3ccccc3)c2c1
InChI Key InChIKey=WMUNVIGBWDVHTK-UHFFFAOYSA-N
Data  1 IC50
  Tab Delimited (TSV)   2D SDfile   Computed 3D by Vconf -m prep SDfile
Find this compound or compounds like it in BindingDB:
Activity Spreadsheet -- Enzyme Inhibition Constant Data from BindingDB
Found 1 hit for monomerid = 215671
TargetBromodomain-containing protein 4 [44-168](Homo sapiens (Human))
Boehringer Ingelheim International
US Patent
LigandPNGBDBM215671(US9296748, I-7)
Affinity DataIC50:  95nM. Assay description: Compounds are diluted in serial dilution 1:5 in assay buffer from 10 mM stock in DMSO (100 μM start concentration) in white OptiPlate-384 (Perki...
Ligand InfoPC cidPC sid
In DepthDetails US Patent