BDBM215697 US9296748, I-33
SMILES C[C@@H](c1ccccc1)n1c(nc2ccc(cc12)C1CN(C)CCO1)-c1cc(C)c(=O)n(C)n1
InChI Key InChIKey=LCOINVLFQBBQFI-VEXWJQHLSA-N
Data  1 IC50
  Tab Delimited (TSV)   2D SDfile   Computed 3D by Vconf -m prep SDfile
Find this compound or compounds like it in BindingDB:
Activity Spreadsheet -- Enzyme Inhibition Constant Data from BindingDB
Found 1 hit for monomerid = 215697
TargetBromodomain-containing protein 4 [44-168](Homo sapiens (Human))
Boehringer Ingelheim International
US Patent
LigandPNGBDBM215697(US9296748, I-33)
Affinity DataIC50:  47nM. Assay description: Compounds are diluted in serial dilution 1:5 in assay buffer from 10 mM stock in DMSO (100 μM start concentration) in white OptiPlate-384 (Perki...
Ligand InfoPC cidPC sid
In DepthDetails US Patent