BDBM215777 US9296748, IV-9
SMILES CN(C)S(=O)(=O)c1cnc2n(Cc3ccccc3)c(nc2c1)-c1cc(C)c(=O)n(C)c1
InChI Key InChIKey=NZTUGGCQTGSXPM-UHFFFAOYSA-N
Data  1 IC50
  Tab Delimited (TSV)   2D SDfile   Computed 3D by Vconf -m prep SDfile
Find this compound or compounds like it in BindingDB:
Activity Spreadsheet -- Enzyme Inhibition Constant Data from BindingDB
Found 1 hit for monomerid = 215777
TargetBromodomain-containing protein 4 [44-168](Homo sapiens (Human))
Boehringer Ingelheim International
US Patent
LigandPNGBDBM215777(US9296748, IV-9)
Affinity DataIC50:  119nM. Assay description: Compounds are diluted in serial dilution 1:5 in assay buffer from 10 mM stock in DMSO (100 μM start concentration) in white OptiPlate-384 (Perki...
Ligand InfoPC cidPC sid
In DepthDetails US Patent