BDBM215970 US9302989, 169
SMILES FC(F)(F)c1cccc(CCNC(=O)c2ccc(NC(=O)N3Cc4ccccc4C3)cc2)c1
InChI Key InChIKey=WJOQCGRWBUDRHC-UHFFFAOYSA-N
Data  1 IC50
  Tab Delimited (TSV)   2D SDfile   Computed 3D by Vconf -m prep SDfile
Find this compound or compounds like it in BindingDB:
Activity Spreadsheet -- Enzyme Inhibition Constant Data from BindingDB
Found 1 hit for monomerid = 215970
TargetNicotinamide phosphoribosyltransferase(Homo sapiens (Human))
Abbvie
US Patent
LigandPNGBDBM215970(US9302989, 169)
Affinity DataIC50:  108nMpH: 7.5Assay Description:Probe 1:The assay was carried out in 18 uL low volume plates (Owens Corning) in reaction buffer (50 mM HEPES (NaOH), pH 7.5, 100 mM NaCl, 10 mM MgCl2...
Ligand InfoPC cidPC sid
In DepthDetails US Patent