BDBM216790 US9302989, 703
SMILES O=C(Nc1ccc(nc1)C1=CCN(CC1)C(=O)C1CCS(=O)(=O)C1)N1Cc2ccncc2C1
InChI Key InChIKey=SBPUBCWRSRILPJ-UHFFFAOYSA-N
Data  1 IC50
  Tab Delimited (TSV)   2D SDfile   Computed 3D by Vconf -m prep SDfile
Find this compound or compounds like it in BindingDB:
Activity Spreadsheet -- Enzyme Inhibition Constant Data from BindingDB
Found 1 hit for monomerid = 216790
TargetNicotinamide phosphoribosyltransferase(Homo sapiens (Human))
Abbvie
US Patent
LigandPNGBDBM216790(US9302989, 703)
Affinity DataIC50:  82.9nMpH: 7.5Assay Description:Probe 2:The assay was carried out in 18 uL low volume plates (Owens Corning) in reaction buffer (50 mM HEPES (NaOH), pH 7.5, 100 mM NaCl, 10 mM MgCl2...
Ligand InfoPC cidPC sid
In DepthDetails US Patent